Obsolete
Status Update
Comments
rn...@google.com <rn...@google.com>
ri...@gmail.com <ri...@gmail.com> #2
2016-08-26 10:20:09,235 [1279593] WARN - nal.AbstractExternalSystemTask - Could not get unknown property 'assembleRelease' for project ':auth' of type org.gradle.api.Project.
com.intellij.openapi.externalSystem.model.LocationAwareExternalSystemException: Could not get unknown property 'assembleRelease' for project ':auth' of type org.gradle.api.Project.
at org.jetbrains.plugins.gradle.service.project.AbstractProjectImportErrorHandler.createUserFriendlyError(AbstractProjectImportErrorHandler.java:103)
at org.jetbrains.plugins.gradle.service.project.BaseProjectImportErrorHandler.getUserFriendlyError(BaseProjectImportErrorHandler.java:158)
at org.jetbrains.plugins.gradle.service.project.BaseGradleProjectResolverExtension.getUserFriendlyError(BaseGradleProjectResolverExtension.java:579)
at org.jetbrains.plugins.gradle.service.project.AbstractProjectResolverExtension.getUserFriendlyError(AbstractProjectResolverExtension.java:158)
at com.android.tools.idea.gradle.project.AndroidGradleProjectResolver.getUserFriendlyError(AndroidGradleProjectResolver.java:405)
at org.jetbrains.plugins.gradle.service.project.GradleProjectResolver$ProjectConnectionDataNodeFunction.fun(GradleProjectResolver.java:772)
at org.jetbrains.plugins.gradle.service.project.GradleProjectResolver$ProjectConnectionDataNodeFunction.fun(GradleProjectResolver.java:752)
at org.jetbrains.plugins.gradle.service.execution.GradleExecutionHelper.execute(GradleExecutionHelper.java:238)
at org.jetbrains.plugins.gradle.service.project.GradleProjectResolver.resolveProjectInfo(GradleProjectResolver.java:112)
at org.jetbrains.plugins.gradle.service.project.GradleProjectResolver.resolveProjectInfo(GradleProjectResolver.java:73)
at com.intellij.openapi.externalSystem.service.remote.RemoteExternalSystemProjectResolverImpl$1.produce(RemoteExternalSystemProjectResolverImpl.java:41)
at com.intellij.openapi.externalSystem.service.remote.RemoteExternalSystemProjectResolverImpl$1.produce(RemoteExternalSystemProjectResolverImpl.java:37)
at com.intellij.openapi.externalSystem.service.remote.AbstractRemoteExternalSystemService.execute(AbstractRemoteExternalSystemService.java:59)
at com.intellij.openapi.externalSystem.service.remote.RemoteExternalSystemProjectResolverImpl.resolveProjectInfo(RemoteExternalSystemProjectResolverImpl.java:37)
at com.intellij.openapi.externalSystem.service.remote.wrapper.ExternalSystemProjectResolverWrapper.resolveProjectInfo(ExternalSystemProjectResolverWrapper.java:49)
at com.intellij.openapi.externalSystem.service.internal.ExternalSystemResolveProjectTask.doExecute(ExternalSystemResolveProjectTask.java:51)
at com.intellij.openapi.externalSystem.service.internal.AbstractExternalSystemTask.execute(AbstractExternalSystemTask.java:138)
at com.intellij.openapi.externalSystem.service.internal.AbstractExternalSystemTask.execute(AbstractExternalSystemTask.java:124)
at com.intellij.openapi.externalSystem.util.ExternalSystemUtil$3.execute(ExternalSystemUtil.java:419)
at com.intellij.openapi.externalSystem.util.ExternalSystemUtil$4$2.run(ExternalSystemUtil.java:500)
com.intellij.openapi.externalSystem.model.LocationAwareExternalSystemException: Could not get unknown property 'assembleRelease' for project ':auth' of type org.gradle.api.Project.
at org.jetbrains.plugins.gradle.service.project.AbstractProjectImportErrorHandler.createUserFriendlyError(AbstractProjectImportErrorHandler.java:103)
at org.jetbrains.plugins.gradle.service.project.BaseProjectImportErrorHandler.getUserFriendlyError(BaseProjectImportErrorHandler.java:158)
at org.jetbrains.plugins.gradle.service.project.BaseGradleProjectResolverExtension.getUserFriendlyError(BaseGradleProjectResolverExtension.java:579)
at org.jetbrains.plugins.gradle.service.project.AbstractProjectResolverExtension.getUserFriendlyError(AbstractProjectResolverExtension.java:158)
at com.android.tools.idea.gradle.project.AndroidGradleProjectResolver.getUserFriendlyError(AndroidGradleProjectResolver.java:405)
at org.jetbrains.plugins.gradle.service.project.GradleProjectResolver$ProjectConnectionDataNodeFunction.fun(GradleProjectResolver.java:772)
at org.jetbrains.plugins.gradle.service.project.GradleProjectResolver$ProjectConnectionDataNodeFunction.fun(GradleProjectResolver.java:752)
at org.jetbrains.plugins.gradle.service.execution.GradleExecutionHelper.execute(GradleExecutionHelper.java:238)
at org.jetbrains.plugins.gradle.service.project.GradleProjectResolver.resolveProjectInfo(GradleProjectResolver.java:112)
at org.jetbrains.plugins.gradle.service.project.GradleProjectResolver.resolveProjectInfo(GradleProjectResolver.java:73)
at com.intellij.openapi.externalSystem.service.remote.RemoteExternalSystemProjectResolverImpl$1.produce(RemoteExternalSystemProjectResolverImpl.java:41)
at com.intellij.openapi.externalSystem.service.remote.RemoteExternalSystemProjectResolverImpl$1.produce(RemoteExternalSystemProjectResolverImpl.java:37)
at com.intellij.openapi.externalSystem.service.remote.AbstractRemoteExternalSystemService.execute(AbstractRemoteExternalSystemService.java:59)
at com.intellij.openapi.externalSystem.service.remote.RemoteExternalSystemProjectResolverImpl.resolveProjectInfo(RemoteExternalSystemProjectResolverImpl.java:37)
at com.intellij.openapi.externalSystem.service.remote.wrapper.ExternalSystemProjectResolverWrapper.resolveProjectInfo(ExternalSystemProjectResolverWrapper.java:49)
at com.intellij.openapi.externalSystem.service.internal.ExternalSystemResolveProjectTask.doExecute(ExternalSystemResolveProjectTask.java:51)
at com.intellij.openapi.externalSystem.service.internal.AbstractExternalSystemTask.execute(AbstractExternalSystemTask.java:138)
at com.intellij.openapi.externalSystem.service.internal.AbstractExternalSystemTask.execute(AbstractExternalSystemTask.java:124)
at com.intellij.openapi.externalSystem.util.ExternalSystemUtil$3.execute(ExternalSystemUtil.java:419)
at com.intellij.openapi.externalSystem.util.ExternalSystemUtil$4$2.run(ExternalSystemUtil.java:500)
ri...@gmail.com <ri...@gmail.com> #3
I am able to reproduce the issue and it's working fine with 2.1.3 and failing only with 2.2.0 plugins.
Jerome/Chris, could you please have a look. Here is the stack trace received from Gradle ...
org.gradle.tooling.BuildException: Could not run build action using Gradle installation '/usr/local/google/home/naveenkumark/Studios/2.2Beta3/android-studio/gradle/gradle-2.14.1'.
at org.gradle.tooling.internal.consumer.ExceptionTransformer.transform(ExceptionTransformer.java:51)
at org.gradle.tooling.internal.consumer.ExceptionTransformer.transform(ExceptionTransformer.java:29)
at org.gradle.tooling.internal.consumer.ResultHandlerAdapter.onFailure(ResultHandlerAdapter.java:41)
at org.gradle.tooling.internal.consumer.async.DefaultAsyncConsumerActionExecutor$1$1.run(DefaultAsyncConsumerActionExecutor.java:57)
at org.gradle.internal.concurrent.ExecutorPolicy$CatchAndRecordFailures.onExecute(ExecutorPolicy.java:54)
at org.gradle.internal.concurrent.StoppableExecutorImpl$1.run(StoppableExecutorImpl.java:40)
at java.util.concurrent.ThreadPoolExecutor.runWorker(ThreadPoolExecutor.java:1142)
at java.util.concurrent.ThreadPoolExecutor$Worker.run(ThreadPoolExecutor.java:617)
at java.lang.Thread.run(Thread.java:745)
at org.gradle.tooling.internal.consumer.BlockingResultHandler.getResult(BlockingResultHandler.java:46)
at org.gradle.tooling.internal.consumer.DefaultBuildActionExecuter.run(DefaultBuildActionExecuter.java:48)
at org.jetbrains.plugins.gradle.service.project.GradleProjectResolver.doResolveProjectInfo(GradleProjectResolver.java:217)
at org.jetbrains.plugins.gradle.service.project.GradleProjectResolver.access$300(GradleProjectResolver.java:73)
at org.jetbrains.plugins.gradle.service.project.GradleProjectResolver$ProjectConnectionDataNodeFunction.fun(GradleProjectResolver.java:768)
at org.jetbrains.plugins.gradle.service.project.GradleProjectResolver$ProjectConnectionDataNodeFunction.fun(GradleProjectResolver.java:752)
at org.jetbrains.plugins.gradle.service.execution.GradleExecutionHelper.execute(GradleExecutionHelper.java:238)
at org.jetbrains.plugins.gradle.service.project.GradleProjectResolver.resolveProjectInfo(GradleProjectResolver.java:112)
at org.jetbrains.plugins.gradle.service.project.GradleProjectResolver.resolveProjectInfo(GradleProjectResolver.java:73)
at com.intellij.openapi.externalSystem.service.remote.RemoteExternalSystemProjectResolverImpl$1.produce(RemoteExternalSystemProjectResolverImpl.java:41)
at com.intellij.openapi.externalSystem.service.remote.RemoteExternalSystemProjectResolverImpl$1.produce(RemoteExternalSystemProjectResolverImpl.java:37)
at com.intellij.openapi.externalSystem.service.remote.AbstractRemoteExternalSystemService.execute(AbstractRemoteExternalSystemService.java:59)
at com.intellij.openapi.externalSystem.service.remote.RemoteExternalSystemProjectResolverImpl.resolveProjectInfo(RemoteExternalSystemProjectResolverImpl.java:37)
at com.intellij.openapi.externalSystem.service.remote.wrapper.ExternalSystemProjectResolverWrapper.resolveProjectInfo(ExternalSystemProjectResolverWrapper.java:49)
at com.intellij.openapi.externalSystem.service.internal.ExternalSystemResolveProjectTask.doExecute(ExternalSystemResolveProjectTask.java:51)
at com.intellij.openapi.externalSystem.service.internal.AbstractExternalSystemTask.execute(AbstractExternalSystemTask.java:138)
at com.intellij.openapi.externalSystem.service.internal.AbstractExternalSystemTask.execute(AbstractExternalSystemTask.java:124)
at com.intellij.openapi.externalSystem.util.ExternalSystemUtil$3.execute(ExternalSystemUtil.java:419)
at com.intellij.openapi.externalSystem.util.ExternalSystemUtil$4$2.run(ExternalSystemUtil.java:500)
at com.intellij.openapi.progress.impl.CoreProgressManager$TaskRunnable.run(CoreProgressManager.java:563)
at com.intellij.openapi.progress.impl.CoreProgressManager$2.run(CoreProgressManager.java:142)
at com.intellij.openapi.progress.impl.CoreProgressManager.registerIndicatorAndRun(CoreProgressManager.java:446)
at com.intellij.openapi.progress.impl.CoreProgressManager.executeProcessUnderProgress(CoreProgressManager.java:392)
at com.intellij.openapi.progress.impl.ProgressManagerImpl.executeProcessUnderProgress(ProgressManagerImpl.java:54)
at com.intellij.openapi.progress.impl.CoreProgressManager.runProcess(CoreProgressManager.java:127)
at com.intellij.openapi.progress.impl.ProgressManagerImpl$1.run(ProgressManagerImpl.java:126)
at com.intellij.openapi.application.impl.ApplicationImpl$8.run(ApplicationImpl.java:369)
at java.util.concurrent.Executors$RunnableAdapter.call(Executors.java:511)
at java.util.concurrent.FutureTask.run(FutureTask.java:266)
at java.util.concurrent.ThreadPoolExecutor.runWorker(ThreadPoolExecutor.java:1142)
at java.util.concurrent.ThreadPoolExecutor$Worker.run(ThreadPoolExecutor.java:617)
at java.lang.Thread.run(Thread.java:745)
Caused by: org.gradle.internal.exceptions.LocationAwareException: Build file '/usr/local/google/home/naveenkumark/AndroidStudioProjects/MyTestProj/FirebaseUI-Android/build.gradle' line: 167
A problem occurred evaluating root project 'FirebaseUI-Android'.
at org.gradle.initialization.DefaultExceptionAnalyser.transform(DefaultExceptionAnalyser.java:74)
at org.gradle.initialization.MultipleBuildFailuresExceptionAnalyser.transform(MultipleBuildFailuresExceptionAnalyser.java:47)
at org.gradle.initialization.StackTraceSanitizingExceptionAnalyser.transform(StackTraceSanitizingExceptionAnalyser.java:30)
at org.gradle.initialization.DefaultGradleLauncher$1.create(DefaultGradleLauncher.java:100)
at org.gradle.initialization.DefaultGradleLauncher$1.create(DefaultGradleLauncher.java:92)
at org.gradle.internal.progress.DefaultBuildOperationExecutor.run(DefaultBuildOperationExecutor.java:91)
at org.gradle.internal.progress.DefaultBuildOperationExecutor.run(DefaultBuildOperationExecutor.java:63)
at org.gradle.initialization.DefaultGradleLauncher.doBuild(DefaultGradleLauncher.java:92)
at org.gradle.initialization.DefaultGradleLauncher.getBuildAnalysis(DefaultGradleLauncher.java:88)
at org.gradle.launcher.exec.InProcessBuildActionExecuter$DefaultBuildController.configure(InProcessBuildActionExecuter.java:107)
at org.gradle.tooling.internal.provider.runner.ClientProvidedBuildActionRunner.run(ClientProvidedBuildActionRunner.java:45)
at org.gradle.launcher.exec.ChainingBuildActionRunner.run(ChainingBuildActionRunner.java:35)
at org.gradle.tooling.internal.provider.runner.SubscribableBuildActionRunner.run(SubscribableBuildActionRunner.java:58)
at org.gradle.launcher.exec.ChainingBuildActionRunner.run(ChainingBuildActionRunner.java:35)
at org.gradle.launcher.exec.InProcessBuildActionExecuter.execute(InProcessBuildActionExecuter.java:48)
at org.gradle.launcher.exec.InProcessBuildActionExecuter.execute(InProcessBuildActionExecuter.java:30)
at org.gradle.launcher.exec.ContinuousBuildActionExecuter.execute(ContinuousBuildActionExecuter.java:81)
at org.gradle.launcher.exec.ContinuousBuildActionExecuter.execute(ContinuousBuildActionExecuter.java:46)
at org.gradle.launcher.daemon.server.exec.ExecuteBuild.doBuild(ExecuteBuild.java:52)
at org.gradle.launcher.daemon.server.exec.BuildCommandOnly.execute(BuildCommandOnly.java:36)
at org.gradle.launcher.daemon.server.api.DaemonCommandExecution.proceed(DaemonCommandExecution.java:120)
at org.gradle.launcher.daemon.server.exec.WatchForDisconnection.execute(WatchForDisconnection.java:37)
at org.gradle.launcher.daemon.server.api.DaemonCommandExecution.proceed(DaemonCommandExecution.java:120)
at org.gradle.launcher.daemon.server.exec.ResetDeprecationLogger.execute(ResetDeprecationLogger.java:26)
at org.gradle.launcher.daemon.server.api.DaemonCommandExecution.proceed(DaemonCommandExecution.java:120)
at org.gradle.launcher.daemon.server.exec.RequestStopIfSingleUsedDaemon.execute(RequestStopIfSingleUsedDaemon.java:34)
at org.gradle.launcher.daemon.server.api.DaemonCommandExecution.proceed(DaemonCommandExecution.java:120)
at org.gradle.launcher.daemon.server.exec.ForwardClientInput$2.call(ForwardClientInput.java:74)
at org.gradle.launcher.daemon.server.exec.ForwardClientInput$2.call(ForwardClientInput.java:72)
at org.gradle.util.Swapper.swap(Swapper.java:38)
at org.gradle.launcher.daemon.server.exec.ForwardClientInput.execute(ForwardClientInput.java:72)
at org.gradle.launcher.daemon.server.api.DaemonCommandExecution.proceed(DaemonCommandExecution.java:120)
at org.gradle.launcher.daemon.server.health.DaemonHealthTracker.execute(DaemonHealthTracker.java:47)
at org.gradle.launcher.daemon.server.api.DaemonCommandExecution.proceed(DaemonCommandExecution.java:120)
at org.gradle.launcher.daemon.server.exec.LogToClient.doBuild(LogToClient.java:60)
at org.gradle.launcher.daemon.server.exec.BuildCommandOnly.execute(BuildCommandOnly.java:36)
at org.gradle.launcher.daemon.server.api.DaemonCommandExecution.proceed(DaemonCommandExecution.java:120)
at org.gradle.launcher.daemon.server.exec.EstablishBuildEnvironment.doBuild(EstablishBuildEnvironment.java:72)
at org.gradle.launcher.daemon.server.exec.BuildCommandOnly.execute(BuildCommandOnly.java:36)
at org.gradle.launcher.daemon.server.api.DaemonCommandExecution.proceed(DaemonCommandExecution.java:120)
at org.gradle.launcher.daemon.server.health.HintGCAfterBuild.execute(HintGCAfterBuild.java:41)
at org.gradle.launcher.daemon.server.api.DaemonCommandExecution.proceed(DaemonCommandExecution.java:120)
at org.gradle.launcher.daemon.server.exec.StartBuildOrRespondWithBusy$1.run(StartBuildOrRespondWithBusy.java:50)
at org.gradle.launcher.daemon.server.DaemonStateCoordinator$1.run(DaemonStateCoordinator.java:237)
at org.gradle.internal.concurrent.ExecutorPolicy$CatchAndRecordFailures.onExecute(ExecutorPolicy.java:54)
at org.gradle.internal.concurrent.StoppableExecutorImpl$1.run(StoppableExecutorImpl.java:40)
Caused by: org.gradle.api.GradleScriptException: A problem occurred evaluating root project 'FirebaseUI-Android'.
at org.gradle.groovy.scripts.internal.DefaultScriptRunnerFactory$ScriptRunnerImpl.run(DefaultScriptRunnerFactory.java:93)
at org.gradle.configuration.DefaultScriptPluginFactory$ScriptPluginImpl$2.run(DefaultScriptPluginFactory.java:177)
at org.gradle.configuration.ProjectScriptTarget.addConfiguration(ProjectScriptTarget.java:77)
at org.gradle.configuration.DefaultScriptPluginFactory$ScriptPluginImpl.apply(DefaultScriptPluginFactory.java:182)
at org.gradle.configuration.project.BuildScriptProcessor.execute(BuildScriptProcessor.java:38)
at org.gradle.configuration.project.BuildScriptProcessor.execute(BuildScriptProcessor.java:25)
at org.gradle.configuration.project.ConfigureActionsProjectEvaluator.evaluate(ConfigureActionsProjectEvaluator.java:34)
at org.gradle.configuration.project.LifecycleProjectEvaluator.evaluate(LifecycleProjectEvaluator.java:55)
at org.gradle.api.internal.project.AbstractProject.evaluate(AbstractProject.java:540)
at org.gradle.api.internal.project.AbstractProject.evaluate(AbstractProject.java:93)
at org.gradle.execution.TaskPathProjectEvaluator.configureHierarchy(TaskPathProjectEvaluator.java:42)
at org.gradle.configuration.DefaultBuildConfigurer.configure(DefaultBuildConfigurer.java:35)
at org.gradle.initialization.DefaultGradleLauncher$2.run(DefaultGradleLauncher.java:124)
at org.gradle.internal.Factories$1.create(Factories.java:22)
at org.gradle.internal.progress.DefaultBuildOperationExecutor.run(DefaultBuildOperationExecutor.java:91)
at org.gradle.internal.progress.DefaultBuildOperationExecutor.run(DefaultBuildOperationExecutor.java:53)
at org.gradle.initialization.DefaultGradleLauncher.doBuildStages(DefaultGradleLauncher.java:121)
at org.gradle.initialization.DefaultGradleLauncher.access$200(DefaultGradleLauncher.java:32)
at org.gradle.initialization.DefaultGradleLauncher$1.create(DefaultGradleLauncher.java:98)
... 42 more
Caused by: groovy.lang.MissingPropertyException: Could not get unknown property 'assembleRelease' for project ':auth' of type org.gradle.api.Project.
at org.gradle.internal.metaobject.AbstractDynamicObject.getMissingProperty(AbstractDynamicObject.java:85)
at org.gradle.internal.metaobject.ConfigureDelegate.getProperty(ConfigureDelegate.java:134)
at build_dr2olvbm3jtirs2sda9jjrgza$_run_closure3.doCall(/usr/local/google/home/naveenkumark/AndroidStudioProjects/MyTestProj/FirebaseUI-Android/build.gradle:167)
at org.gradle.api.internal.ClosureBackedAction.execute(ClosureBackedAction.java:67)
at org.gradle.util.ConfigureUtil.configure(ConfigureUtil.java:107)
at org.gradle.api.internal.project.AbstractProject.configure(AbstractProject.java:888)
at org.gradle.api.internal.project.AbstractProject.configure(AbstractProject.java:893)
at org.gradle.api.internal.project.AbstractProject.allprojects(AbstractProject.java:880)
at org.gradle.internal.metaobject.BeanDynamicObject$MetaClassAdapter.invokeMethod(BeanDynamicObject.java:374)
at org.gradle.internal.metaobject.BeanDynamicObject.invokeMethod(BeanDynamicObject.java:169)
at org.gradle.internal.metaobject.CompositeDynamicObject.invokeMethod(CompositeDynamicObject.java:96)
at org.gradle.internal.metaobject.MixInClosurePropertiesAsMethodsDynamicObject.invokeMethod(MixInClosurePropertiesAsMethodsDynamicObject.java:30)
at org.gradle.internal.metaobject.AbstractDynamicObject.invokeMethod(AbstractDynamicObject.java:163)
at org.gradle.groovy.scripts.BasicScript.methodMissing(BasicScript.java:79)
at build_dr2olvbm3jtirs2sda9jjrgza.run(/usr/local/google/home/naveenkumark/AndroidStudioProjects/MyTestProj/FirebaseUI-Android/build.gradle:37)
at org.gradle.groovy.scripts.internal.DefaultScriptRunnerFactory$ScriptRunnerImpl.run(DefaultScriptRunnerFactory.java:91)
... 60 more
Jerome/Chris, could you please have a look. Here is the stack trace received from Gradle ...
org.gradle.tooling.BuildException: Could not run build action using Gradle installation '/usr/local/google/home/naveenkumark/Studios/2.2Beta3/android-studio/gradle/gradle-2.14.1'.
at org.gradle.tooling.internal.consumer.ExceptionTransformer.transform(ExceptionTransformer.java:51)
at org.gradle.tooling.internal.consumer.ExceptionTransformer.transform(ExceptionTransformer.java:29)
at org.gradle.tooling.internal.consumer.ResultHandlerAdapter.onFailure(ResultHandlerAdapter.java:41)
at org.gradle.tooling.internal.consumer.async.DefaultAsyncConsumerActionExecutor$1$1.run(DefaultAsyncConsumerActionExecutor.java:57)
at org.gradle.internal.concurrent.ExecutorPolicy$CatchAndRecordFailures.onExecute(ExecutorPolicy.java:54)
at org.gradle.internal.concurrent.StoppableExecutorImpl$1.run(StoppableExecutorImpl.java:40)
at java.util.concurrent.ThreadPoolExecutor.runWorker(ThreadPoolExecutor.java:1142)
at java.util.concurrent.ThreadPoolExecutor$Worker.run(ThreadPoolExecutor.java:617)
at java.lang.Thread.run(Thread.java:745)
at org.gradle.tooling.internal.consumer.BlockingResultHandler.getResult(BlockingResultHandler.java:46)
at org.gradle.tooling.internal.consumer.DefaultBuildActionExecuter.run(DefaultBuildActionExecuter.java:48)
at org.jetbrains.plugins.gradle.service.project.GradleProjectResolver.doResolveProjectInfo(GradleProjectResolver.java:217)
at org.jetbrains.plugins.gradle.service.project.GradleProjectResolver.access$300(GradleProjectResolver.java:73)
at org.jetbrains.plugins.gradle.service.project.GradleProjectResolver$ProjectConnectionDataNodeFunction.fun(GradleProjectResolver.java:768)
at org.jetbrains.plugins.gradle.service.project.GradleProjectResolver$ProjectConnectionDataNodeFunction.fun(GradleProjectResolver.java:752)
at org.jetbrains.plugins.gradle.service.execution.GradleExecutionHelper.execute(GradleExecutionHelper.java:238)
at org.jetbrains.plugins.gradle.service.project.GradleProjectResolver.resolveProjectInfo(GradleProjectResolver.java:112)
at org.jetbrains.plugins.gradle.service.project.GradleProjectResolver.resolveProjectInfo(GradleProjectResolver.java:73)
at com.intellij.openapi.externalSystem.service.remote.RemoteExternalSystemProjectResolverImpl$1.produce(RemoteExternalSystemProjectResolverImpl.java:41)
at com.intellij.openapi.externalSystem.service.remote.RemoteExternalSystemProjectResolverImpl$1.produce(RemoteExternalSystemProjectResolverImpl.java:37)
at com.intellij.openapi.externalSystem.service.remote.AbstractRemoteExternalSystemService.execute(AbstractRemoteExternalSystemService.java:59)
at com.intellij.openapi.externalSystem.service.remote.RemoteExternalSystemProjectResolverImpl.resolveProjectInfo(RemoteExternalSystemProjectResolverImpl.java:37)
at com.intellij.openapi.externalSystem.service.remote.wrapper.ExternalSystemProjectResolverWrapper.resolveProjectInfo(ExternalSystemProjectResolverWrapper.java:49)
at com.intellij.openapi.externalSystem.service.internal.ExternalSystemResolveProjectTask.doExecute(ExternalSystemResolveProjectTask.java:51)
at com.intellij.openapi.externalSystem.service.internal.AbstractExternalSystemTask.execute(AbstractExternalSystemTask.java:138)
at com.intellij.openapi.externalSystem.service.internal.AbstractExternalSystemTask.execute(AbstractExternalSystemTask.java:124)
at com.intellij.openapi.externalSystem.util.ExternalSystemUtil$3.execute(ExternalSystemUtil.java:419)
at com.intellij.openapi.externalSystem.util.ExternalSystemUtil$4$2.run(ExternalSystemUtil.java:500)
at com.intellij.openapi.progress.impl.CoreProgressManager$TaskRunnable.run(CoreProgressManager.java:563)
at com.intellij.openapi.progress.impl.CoreProgressManager$2.run(CoreProgressManager.java:142)
at com.intellij.openapi.progress.impl.CoreProgressManager.registerIndicatorAndRun(CoreProgressManager.java:446)
at com.intellij.openapi.progress.impl.CoreProgressManager.executeProcessUnderProgress(CoreProgressManager.java:392)
at com.intellij.openapi.progress.impl.ProgressManagerImpl.executeProcessUnderProgress(ProgressManagerImpl.java:54)
at com.intellij.openapi.progress.impl.CoreProgressManager.runProcess(CoreProgressManager.java:127)
at com.intellij.openapi.progress.impl.ProgressManagerImpl$1.run(ProgressManagerImpl.java:126)
at com.intellij.openapi.application.impl.ApplicationImpl$8.run(ApplicationImpl.java:369)
at java.util.concurrent.Executors$RunnableAdapter.call(Executors.java:511)
at java.util.concurrent.FutureTask.run(FutureTask.java:266)
at java.util.concurrent.ThreadPoolExecutor.runWorker(ThreadPoolExecutor.java:1142)
at java.util.concurrent.ThreadPoolExecutor$Worker.run(ThreadPoolExecutor.java:617)
at java.lang.Thread.run(Thread.java:745)
Caused by: org.gradle.internal.exceptions.LocationAwareException: Build file '/usr/local/google/home/naveenkumark/AndroidStudioProjects/MyTestProj/FirebaseUI-Android/build.gradle' line: 167
A problem occurred evaluating root project 'FirebaseUI-Android'.
at org.gradle.initialization.DefaultExceptionAnalyser.transform(DefaultExceptionAnalyser.java:74)
at org.gradle.initialization.MultipleBuildFailuresExceptionAnalyser.transform(MultipleBuildFailuresExceptionAnalyser.java:47)
at org.gradle.initialization.StackTraceSanitizingExceptionAnalyser.transform(StackTraceSanitizingExceptionAnalyser.java:30)
at org.gradle.initialization.DefaultGradleLauncher$1.create(DefaultGradleLauncher.java:100)
at org.gradle.initialization.DefaultGradleLauncher$1.create(DefaultGradleLauncher.java:92)
at org.gradle.internal.progress.DefaultBuildOperationExecutor.run(DefaultBuildOperationExecutor.java:91)
at org.gradle.internal.progress.DefaultBuildOperationExecutor.run(DefaultBuildOperationExecutor.java:63)
at org.gradle.initialization.DefaultGradleLauncher.doBuild(DefaultGradleLauncher.java:92)
at org.gradle.initialization.DefaultGradleLauncher.getBuildAnalysis(DefaultGradleLauncher.java:88)
at org.gradle.launcher.exec.InProcessBuildActionExecuter$DefaultBuildController.configure(InProcessBuildActionExecuter.java:107)
at org.gradle.tooling.internal.provider.runner.ClientProvidedBuildActionRunner.run(ClientProvidedBuildActionRunner.java:45)
at org.gradle.launcher.exec.ChainingBuildActionRunner.run(ChainingBuildActionRunner.java:35)
at org.gradle.tooling.internal.provider.runner.SubscribableBuildActionRunner.run(SubscribableBuildActionRunner.java:58)
at org.gradle.launcher.exec.ChainingBuildActionRunner.run(ChainingBuildActionRunner.java:35)
at org.gradle.launcher.exec.InProcessBuildActionExecuter.execute(InProcessBuildActionExecuter.java:48)
at org.gradle.launcher.exec.InProcessBuildActionExecuter.execute(InProcessBuildActionExecuter.java:30)
at org.gradle.launcher.exec.ContinuousBuildActionExecuter.execute(ContinuousBuildActionExecuter.java:81)
at org.gradle.launcher.exec.ContinuousBuildActionExecuter.execute(ContinuousBuildActionExecuter.java:46)
at org.gradle.launcher.daemon.server.exec.ExecuteBuild.doBuild(ExecuteBuild.java:52)
at org.gradle.launcher.daemon.server.exec.BuildCommandOnly.execute(BuildCommandOnly.java:36)
at org.gradle.launcher.daemon.server.api.DaemonCommandExecution.proceed(DaemonCommandExecution.java:120)
at org.gradle.launcher.daemon.server.exec.WatchForDisconnection.execute(WatchForDisconnection.java:37)
at org.gradle.launcher.daemon.server.api.DaemonCommandExecution.proceed(DaemonCommandExecution.java:120)
at org.gradle.launcher.daemon.server.exec.ResetDeprecationLogger.execute(ResetDeprecationLogger.java:26)
at org.gradle.launcher.daemon.server.api.DaemonCommandExecution.proceed(DaemonCommandExecution.java:120)
at org.gradle.launcher.daemon.server.exec.RequestStopIfSingleUsedDaemon.execute(RequestStopIfSingleUsedDaemon.java:34)
at org.gradle.launcher.daemon.server.api.DaemonCommandExecution.proceed(DaemonCommandExecution.java:120)
at org.gradle.launcher.daemon.server.exec.ForwardClientInput$2.call(ForwardClientInput.java:74)
at org.gradle.launcher.daemon.server.exec.ForwardClientInput$2.call(ForwardClientInput.java:72)
at org.gradle.util.Swapper.swap(Swapper.java:38)
at org.gradle.launcher.daemon.server.exec.ForwardClientInput.execute(ForwardClientInput.java:72)
at org.gradle.launcher.daemon.server.api.DaemonCommandExecution.proceed(DaemonCommandExecution.java:120)
at org.gradle.launcher.daemon.server.health.DaemonHealthTracker.execute(DaemonHealthTracker.java:47)
at org.gradle.launcher.daemon.server.api.DaemonCommandExecution.proceed(DaemonCommandExecution.java:120)
at org.gradle.launcher.daemon.server.exec.LogToClient.doBuild(LogToClient.java:60)
at org.gradle.launcher.daemon.server.exec.BuildCommandOnly.execute(BuildCommandOnly.java:36)
at org.gradle.launcher.daemon.server.api.DaemonCommandExecution.proceed(DaemonCommandExecution.java:120)
at org.gradle.launcher.daemon.server.exec.EstablishBuildEnvironment.doBuild(EstablishBuildEnvironment.java:72)
at org.gradle.launcher.daemon.server.exec.BuildCommandOnly.execute(BuildCommandOnly.java:36)
at org.gradle.launcher.daemon.server.api.DaemonCommandExecution.proceed(DaemonCommandExecution.java:120)
at org.gradle.launcher.daemon.server.health.HintGCAfterBuild.execute(HintGCAfterBuild.java:41)
at org.gradle.launcher.daemon.server.api.DaemonCommandExecution.proceed(DaemonCommandExecution.java:120)
at org.gradle.launcher.daemon.server.exec.StartBuildOrRespondWithBusy$1.run(StartBuildOrRespondWithBusy.java:50)
at org.gradle.launcher.daemon.server.DaemonStateCoordinator$1.run(DaemonStateCoordinator.java:237)
at org.gradle.internal.concurrent.ExecutorPolicy$CatchAndRecordFailures.onExecute(ExecutorPolicy.java:54)
at org.gradle.internal.concurrent.StoppableExecutorImpl$1.run(StoppableExecutorImpl.java:40)
Caused by: org.gradle.api.GradleScriptException: A problem occurred evaluating root project 'FirebaseUI-Android'.
at org.gradle.groovy.scripts.internal.DefaultScriptRunnerFactory$ScriptRunnerImpl.run(DefaultScriptRunnerFactory.java:93)
at org.gradle.configuration.DefaultScriptPluginFactory$ScriptPluginImpl$2.run(DefaultScriptPluginFactory.java:177)
at org.gradle.configuration.ProjectScriptTarget.addConfiguration(ProjectScriptTarget.java:77)
at org.gradle.configuration.DefaultScriptPluginFactory$ScriptPluginImpl.apply(DefaultScriptPluginFactory.java:182)
at org.gradle.configuration.project.BuildScriptProcessor.execute(BuildScriptProcessor.java:38)
at org.gradle.configuration.project.BuildScriptProcessor.execute(BuildScriptProcessor.java:25)
at org.gradle.configuration.project.ConfigureActionsProjectEvaluator.evaluate(ConfigureActionsProjectEvaluator.java:34)
at org.gradle.configuration.project.LifecycleProjectEvaluator.evaluate(LifecycleProjectEvaluator.java:55)
at org.gradle.api.internal.project.AbstractProject.evaluate(AbstractProject.java:540)
at org.gradle.api.internal.project.AbstractProject.evaluate(AbstractProject.java:93)
at org.gradle.execution.TaskPathProjectEvaluator.configureHierarchy(TaskPathProjectEvaluator.java:42)
at org.gradle.configuration.DefaultBuildConfigurer.configure(DefaultBuildConfigurer.java:35)
at org.gradle.initialization.DefaultGradleLauncher$2.run(DefaultGradleLauncher.java:124)
at org.gradle.internal.Factories$1.create(Factories.java:22)
at org.gradle.internal.progress.DefaultBuildOperationExecutor.run(DefaultBuildOperationExecutor.java:91)
at org.gradle.internal.progress.DefaultBuildOperationExecutor.run(DefaultBuildOperationExecutor.java:53)
at org.gradle.initialization.DefaultGradleLauncher.doBuildStages(DefaultGradleLauncher.java:121)
at org.gradle.initialization.DefaultGradleLauncher.access$200(DefaultGradleLauncher.java:32)
at org.gradle.initialization.DefaultGradleLauncher$1.create(DefaultGradleLauncher.java:98)
... 42 more
Caused by: groovy.lang.MissingPropertyException: Could not get unknown property 'assembleRelease' for project ':auth' of type org.gradle.api.Project.
at org.gradle.internal.metaobject.AbstractDynamicObject.getMissingProperty(AbstractDynamicObject.java:85)
at org.gradle.internal.metaobject.ConfigureDelegate.getProperty(ConfigureDelegate.java:134)
at build_dr2olvbm3jtirs2sda9jjrgza$_run_closure3.doCall(/usr/local/google/home/naveenkumark/AndroidStudioProjects/MyTestProj/FirebaseUI-Android/build.gradle:167)
at org.gradle.api.internal.ClosureBackedAction.execute(ClosureBackedAction.java:67)
at org.gradle.util.ConfigureUtil.configure(ConfigureUtil.java:107)
at org.gradle.api.internal.project.AbstractProject.configure(AbstractProject.java:888)
at org.gradle.api.internal.project.AbstractProject.configure(AbstractProject.java:893)
at org.gradle.api.internal.project.AbstractProject.allprojects(AbstractProject.java:880)
at org.gradle.internal.metaobject.BeanDynamicObject$MetaClassAdapter.invokeMethod(BeanDynamicObject.java:374)
at org.gradle.internal.metaobject.BeanDynamicObject.invokeMethod(BeanDynamicObject.java:169)
at org.gradle.internal.metaobject.CompositeDynamicObject.invokeMethod(CompositeDynamicObject.java:96)
at org.gradle.internal.metaobject.MixInClosurePropertiesAsMethodsDynamicObject.invokeMethod(MixInClosurePropertiesAsMethodsDynamicObject.java:30)
at org.gradle.internal.metaobject.AbstractDynamicObject.invokeMethod(AbstractDynamicObject.java:163)
at org.gradle.groovy.scripts.BasicScript.methodMissing(BasicScript.java:79)
at build_dr2olvbm3jtirs2sda9jjrgza.run(/usr/local/google/home/naveenkumark/AndroidStudioProjects/MyTestProj/FirebaseUI-Android/build.gradle:37)
at org.gradle.groovy.scripts.internal.DefaultScriptRunnerFactory$ScriptRunnerImpl.run(DefaultScriptRunnerFactory.java:91)
... 60 more
ri...@gmail.com <ri...@gmail.com> #4
Triage: Jerome taking a look today!
rn...@google.com <rn...@google.com> #5
this issue is in the Firebase build.gradle.
in 2.2, we have decided to move the task creation from the configuration time to the "afterEvaluate" phase. The firebase build.gradle is relying on "assembleRelease" task to be created in the configuration phase.
In general, modules should not directly depend on task from another module.
Instead users should move the code referencing those tasks in the afterEvaluate closure, or use string based look ups.
The code change below is how to change the build.gradle to build both with 2.1.3 and 2.2 plugins :
diff --git a/build.gradle b/build.gradle
index f9c0764..1045cd3 100644
--- a/build.gradle
+++ b/build.gradle
@@ -44,9 +44,6 @@ allprojects { project ->
def isLibrary = 'library'.equals(project.name )
def isSubmodule = project.ext.submodules.contains(project.name )
- // Only applies to submodules, not the library module
- def pomTask = "generatePomFileFor${project.name.capitalize()}LibraryPublication";
-
if (isSubmodule || isLibrary) {
// So that we can resolve 'android' variable
@@ -163,8 +160,6 @@ allprojects { project ->
}
if (isSubmodule) {
- // Convenience task to prepare everything we need for releases
- task prepareArtifacts(dependsOn: [javadocJar, sourcesJar, assembleRelease, pomTask]) {}
publishing {
@@ -276,3 +271,16 @@ allprojects { project ->
}
}
}
+
+allprojects { afterEvaluate { project ->
+ def isSubmodule = project.ext.submodules.contains(project.name )
+
+ if (isSubmodule) {
+ // Only applies to submodules, not the library module
+ def pomTask = "generatePomFileFor${project.name.capitalize()}LibraryPublication";
+
+ // Convenience task to prepare everything we need for releases
+ task prepareArtifacts(dependsOn: [javadocJar, sourcesJar, assembleRelease, pomTask]) {}
+
+ }
+}}
diff --git a/library/build.gradle b/library/build.gradle
index b07244f..c0a3884 100644
--- a/library/build.gradle
+++ b/library/build.gradle
@@ -65,15 +65,17 @@ def testTasks() {
}.toArray()
}
-/**
- * Prepare artifacts for this an all sub-projects.
- */
-task prepareArtifacts(dependsOn: [
- javadocJar,
- sourcesJar,
- assembleRelease,
- prepareArtifactsTasks(),
- "generatePomFileForMonolithLibraryPublication"]) {
+afterEvaluate {
+ /**
+ * Prepare artifacts for this an all sub-projects.
+ */
+ task prepareArtifacts(dependsOn: [
+ javadocJar,
+ sourcesJar,
+ assembleRelease,
+ prepareArtifactsTasks(),
+ "generatePomFileForMonolithLibraryPublication"]) {
+ }
}
in 2.2, we have decided to move the task creation from the configuration time to the "afterEvaluate" phase. The firebase build.gradle is relying on "assembleRelease" task to be created in the configuration phase.
In general, modules should not directly depend on task from another module.
Instead users should move the code referencing those tasks in the afterEvaluate closure, or use string based look ups.
The code change below is how to change the build.gradle to build both with 2.1.3 and 2.2 plugins :
diff --git a/build.gradle b/build.gradle
index f9c0764..1045cd3 100644
--- a/build.gradle
+++ b/build.gradle
@@ -44,9 +44,6 @@ allprojects { project ->
def isLibrary = 'library'.equals(
def isSubmodule = project.ext.submodules.contains(
- // Only applies to submodules, not the library module
- def pomTask = "generatePomFileFor${project.name.capitalize()}LibraryPublication";
-
if (isSubmodule || isLibrary) {
// So that we can resolve 'android' variable
@@ -163,8 +160,6 @@ allprojects { project ->
}
if (isSubmodule) {
- // Convenience task to prepare everything we need for releases
- task prepareArtifacts(dependsOn: [javadocJar, sourcesJar, assembleRelease, pomTask]) {}
publishing {
@@ -276,3 +271,16 @@ allprojects { project ->
}
}
}
+
+allprojects { afterEvaluate { project ->
+ def isSubmodule = project.ext.submodules.contains(
+
+ if (isSubmodule) {
+ // Only applies to submodules, not the library module
+ def pomTask = "generatePomFileFor${project.name.capitalize()}LibraryPublication";
+
+ // Convenience task to prepare everything we need for releases
+ task prepareArtifacts(dependsOn: [javadocJar, sourcesJar, assembleRelease, pomTask]) {}
+
+ }
+}}
diff --git a/library/build.gradle b/library/build.gradle
index b07244f..c0a3884 100644
--- a/library/build.gradle
+++ b/library/build.gradle
@@ -65,15 +65,17 @@ def testTasks() {
}.toArray()
}
-/**
- * Prepare artifacts for this an all sub-projects.
- */
-task prepareArtifacts(dependsOn: [
- javadocJar,
- sourcesJar,
- assembleRelease,
- prepareArtifactsTasks(),
- "generatePomFileForMonolithLibraryPublication"]) {
+afterEvaluate {
+ /**
+ * Prepare artifacts for this an all sub-projects.
+ */
+ task prepareArtifacts(dependsOn: [
+ javadocJar,
+ sourcesJar,
+ assembleRelease,
+ prepareArtifactsTasks(),
+ "generatePomFileForMonolithLibraryPublication"]) {
+ }
}
ri...@gmail.com <ri...@gmail.com> #6
Re-assigning to the Firebase team.
ri...@gmail.com <ri...@gmail.com> #7
This doesn't seem to be related to the Firebase Assist plugin. This just appears to be sample build code that isn't compatible with the changes jedo mentioned. I'm pinging Sam (DevRel who owns the sample) about this to confirm it's something they can fix.
rn...@google.com <rn...@google.com> #8
I can't seem to give Sam access so he can see the bug.
ri...@gmail.com <ri...@gmail.com> #9
Downgrading this and moving this out of our component since this is a sample issue. Thanks for taking a look Paul.
ri...@gmail.com <ri...@gmail.com> #10
ri...@gmail.com <ri...@gmail.com> #11
Marking this bug as duplicate as it refers to the same underlying issue as the other bug.
ri...@gmail.com <ri...@gmail.com> #12
ri...@gmail.com <ri...@gmail.com> #13
[Comment deleted]
ri...@gmail.com <ri...@gmail.com> #14
[Comment deleted]
ri...@gmail.com <ri...@gmail.com> #15
Interesting feature
11-06 00:39:47.593 32384-32414/com.example.user_gex.9505_camerafeatures E/Surface: getSlotFromBufferLocked: unknown buffer: 0xab47c490
11-06 00:39:47.784 32384-32384/com.example.user_gex.9505_camerafeatures E/Camera: Error 2
It is working with the declared object type of Surface, but without it there - hence it can not be used LED Torch without Surface for Marshmallow ,unfortunately(lost compatibility with the old production code)
11-06 00:39:47.593 32384-32414/com.example.user_gex.9505_camerafeatures E/Surface: getSlotFromBufferLocked: unknown buffer: 0xab47c490
11-06 00:39:47.784 32384-32384/com.example.user_gex.9505_camerafeatures E/Camera: Error 2
It is working with the declared object type of Surface, but without it there - hence it can not be used LED Torch without Surface for Marshmallow ,unfortunately(lost compatibility with the old production code)
et...@google.com <et...@google.com> #16
The tutorial linked in #13 is incorrect. It is missing an important step, which is listed in the developer documentation for the old camera API:
"
5. Important: Pass a fully initialized SurfaceHolder to setPreviewDisplay(SurfaceHolder). Without a surface, the camera will be unable to start the preview.
"
http://developer.android.com/reference/android/hardware/Camera.html
You can also use setPreviewTexture instead of setPreviewDisplay, but one or the other must be called before preview can start, and the flashlight will not turn on unless preview is active. Some devices may unfortunately act more lax and allow preview to run without calling these methods, but not all can.
If you don't want to display camera preview, then just create a dummy SurfaceTexture object:
SurfaceTexture mDummy;
..
mDummy = new SurfaceTexture(1); // any int argument will do
camera.setPreviewTexture(mDummy);
camera.startPreview();
"
5. Important: Pass a fully initialized SurfaceHolder to setPreviewDisplay(SurfaceHolder). Without a surface, the camera will be unable to start the preview.
"
You can also use setPreviewTexture instead of setPreviewDisplay, but one or the other must be called before preview can start, and the flashlight will not turn on unless preview is active. Some devices may unfortunately act more lax and allow preview to run without calling these methods, but not all can.
If you don't want to display camera preview, then just create a dummy SurfaceTexture object:
SurfaceTexture mDummy;
..
mDummy = new SurfaceTexture(1); // any int argument will do
camera.setPreviewTexture(mDummy);
camera.startPreview();
Description
don't work flashlight in Android 6 (
params = camera.getParameters();
params.setFlashMode(Parameters.FLASH_MODE_TORCH);
camera.setParameters(params); camera.startPreview();
)
it is don't worked in Android 6 (nexus5) but worked in android 5 maybe it's the lack of backward compatibility?
Many of the old lights app with play market also became don't working,
but more recent work, you may have realized, native access to flash or Camera2