My favorites | Sign in
Project Home Wiki Issues Source
New issue   Search
for
  Advanced search   Search tips   Subscriptions
ListGrid
   
Loading...
  ID Type  Status  Opsys  CPU  Priority  Owner    Summary + Labels ...
  14 Defect Accepted Linux Intel-x86-64 Medium ----   Can't build toolchain on Linux (Ubuntu feisty 64-bit)  
  16 Enhancement Accepted Linux ---- Low Phi...@gmail.com   Create scripts to make deb packages   Usability  
  27 Defect Accepted BSD ---- Medium nightwat...@gmail.com   odcctools build fails on FreeBSD  
  29 Defect Accepted Linux ---- High nightwat...@gmail.com   Linking problems on Linux that cause strip to produce corrupt objects  
  31 Defect Accepted OSX-10.5 ---- Medium ----   odcctools fails on 10.5 9A527 Intel  
  37 Defect Accepted Linux Intel-x86-64 Medium ----   make odcctools fails on fedora x86_64  
  40 Defect Accepted Windows ---- Medium ----   errors making odcctools...errors.c on Windows XP  
  42 Defect New ---- ---- Medium ----   gperf not tested in config  
  46 Enhancement Started ---- ---- Medium onit...@gmail.com   Missing Instructions  
  48 Defect Started ---- ---- Medium nightwat...@gmail.com   C++ exceptions broken  
  50 Defect Waiting ---- ---- Medium ----   #pragma pack(1) BUG  
  58 Enhancement Accepted ---- ---- Medium ----   install-headers.sh and subversion  
  62 Defect New ---- ---- Medium ----   fail to compile odcctool under MinGW  
  63 Defect New ---- ---- Medium ----   "arm-apple-darwin-ld" not created in /usr/local/bin/  
  64 Defect New ---- ---- Medium ----   missing __eprintf symbol  
  65 Defect New ---- ---- Medium ----   OSByteOrder.h:51: error: syntax error before ‘_OSSwapInt32’  
  66 Defect New ---- ---- Medium ----   HelloWorld will not compile cleanly  
  67 Defect New ---- ---- Medium ----   Compile error when Build the toolchain  
  70 Defect Accepted ---- ---- Critical Phi...@gmail.com   LLVM-GCC fails to build with latest svn version  
  72 Defect New ---- ---- Medium ----   -Wreturn-type not reporting missing return statements  
  73 Defect New ---- ---- Medium ----   Running make LLVM_VERSION_INFO=2.0-svn-iphone-dev-0.3-svn dies with configure of libstdc++-v3  
  75 Defect Started ---- ---- High Phi...@gmail.com   Unable to install csu  
  77 Defect New ---- ---- Medium ----   Byte aligning problems when linking llvm-gcc-4.0  
  79 Defect New ---- ---- Medium ----   LLVM-GCC steps assume /usr/local/bin is in your path.  
  82 Defect New ---- ---- Medium ----   make llvm during last steps of build, llvm-backend compilation error  
  83 Enhancement Accepted ---- ---- Critical Phi...@gmail.com   Change back to patching llvm-gcc with a script  
  85 Defect New ---- ---- Medium ----   /usr/local/arm-apple-darwin/include/libkern/OSByteOrder.h:341: error: invalid conversion from 'const volatile void*' to 'volatile void*'  
  88 Defect New ---- ---- Medium ----   Headers for ABAddressBookUI are not provided  
  91 Defect New ---- ---- Medium ----   Building llvm-gcc-4.0-iphone/gcc  
  92 Defect Started OSX-10.5 ---- High Phi...@gmail.com   Compiling LLVM-GCC fails on Leopard  
  93 Defect Waiting ---- ---- Medium ----   llvm-gcc-4.0 build: "/lib/cpp" fails sanity check (during libstdc++-v3)  
  94 Defect New ---- ---- Medium ----   make odcctools fails on fedora x86_64 (libstuff problem)  
  95 Defect New ---- ---- Medium ----   Does not build on gutsy gibbon / intel  
  96 Defect New ---- ---- Medium ----   ODCCTOOLS build failed with MAC OS 10.5 (9A581)  
  97 Defect New ---- ---- Medium ----   install-headers.sh not handling spaces in 'with-macosx-headers=' directory  
  98 Defect New ---- ---- Medium ----   make odcctools fails with "possibly undefined macro: AM_PROG_LEX"  
  99 Defect New ---- ---- Medium ----   build error: "/usr/local/bin/arm-apple-darwin-ld: can't locate file for: -lc"  
  100 Defect New ---- ---- Medium ----   make: *** [all] Error 1  
  101 Defect New ---- ---- Medium ----   failed during make LLVM-GCC  
  102 Defect New ---- ---- Medium ----   xCode 3.0 installation  
  103 Defect New ---- ---- Medium ----   A lot of headers are missing for example WebCore and WebKit  
  104 Defect New ---- ---- Medium ----   Missing UIKeyboardInputProtocol.h file...  
  106 Defect New ---- ---- Medium ----   odcctools fails on 10.5.1 9B18 Intel  
  107 Defect New ---- ---- Medium ----   Failed last step due to missing std-includes  
  108 Defect New ---- ---- Medium ----   llvn-svn: configure: error: C compilter cannot create executables.  
  109 Defect New ---- ---- Medium ----   /usr/local/bin/arm-apple-darwin-ld: can't locate file for: -lc  
  110 Defect New ---- ---- Medium ----   bitypes.h missing  
  111 Defect New ---- ---- Medium ----   Windows toolchain, failed to compile example code  
  112 Defect New ---- ---- Medium ----   "strip: invalid option -- c" during llvm make  
  113 Defect New ---- ---- Medium ----   libstuff error 2 - compiling with cygwin using victzh's patch  
  114 Defect New ---- ---- Medium ----   Build steps should mention gmp and mpfr  
  115 Defect New ---- ---- Medium ----   make LLVM_VERSION_INFO=2.0-svn-iphone-dev-0.3-svn fails with : /lib/cpp fails sanity check  
  116 Defect New ---- ---- Medium ----   odcctools not making  
  117 Defect New ---- ---- Medium ----   Linker Compile Error Hello world  
  118 Defect New ---- ---- Medium ----   llvm compile failes with crt1 cputype errors  
  119 Defect New ---- ---- Medium ----   toolchain installation - error in llvm-gconfigure  
  120 Defect New ---- ---- Medium ----   Apps freeze when opened on the phonde  
  121 Defect New ---- ---- Medium ----   llvm-gcc-4.0-iphone compile error  
  122 Defect New ---- ---- Medium ----   LLVM-GCC fails to make on OS X 10.51  
  124 Defect New ---- ---- Medium ----   build the leopard toolchain failure  
  126 Defect New ---- ---- Medium ----   pseudo LDR instruction is missing in darwin-as  
  127 Defect New ---- ---- Medium ----   jmp_buf and sigjmp_buf need to be at least one word longer  
  128 Defect New ---- ---- Medium ----   odcctools build failing - undefined symbols compling otool  
  129 Defect New ---- ---- Medium ----   llvm configure fails on gutsy 32bit  
  130 Defect New ---- ---- Medium ----   open tool chain build error  
  131 Defect New ---- ---- Medium ----   arm/setjmp.h missing C++ guards  
  132 Defect New ---- ---- Medium ----   make LLVM_VERSION_INFO=2.0-svn-iphone-dev-0.3-svn error [configure-fixincludes] Error 1  
  133 Defect New ---- ---- Medium ----   Compiling Example Three from iPhone Open Dev. Book gives error  
  134 Defect New ---- ---- Medium ----   arm-apple-darwin-ld: can't locate file for: -ldylib1.10.5.o  
  135 Defect New ---- ---- Medium ----   gcc build fails with Can't relocate expression. Absolute 0 assumed.  
  136 Defect New ---- ---- Medium ----   odcctools fails to compile on Ubuntu 8.04  
  137 Defect New ---- ---- Medium ----   can't locate file for: -lobjc  
  138 Defect New ---- ---- Medium ----   Bus error  
  139 Defect New ---- ---- Medium ----   Toolchain will not compile code after what seems to be an successful toolchain compilation  
  140 Defect New ---- ---- Medium ----   can't locate framework for: -framework CoreFoundation  
  141 Defect New ---- ---- Medium ----   libc.dylib load command 7 unknown cmd field  
  142 Defect New ---- ---- Medium ----   LLVMBuilder.h was renamed to IRBuilder.h  
  143 Defect New ---- ---- Medium ----   FATAL:error constructing pseudo-op table (exists)  
  144 Defect New ---- ---- Medium ----   ld64  
  145 Defect New ---- ---- Medium ----   lib1funcs.asm:670:garbage following instruction  
  146 Defect New ---- ---- Medium ----   compile assemble file fail  
  147 Defect New ---- ---- Medium ----   previous definition "_OSSwapInt16" was here  
  148 Defect New ---- ---- Medium ----   readdir in C lib doesn't work  
  149 Defect New ---- ---- Medium ----   Compilation of LLVM fails  
  150 Defect New ---- ---- Medium ----   make LLVM_VERSION_INFO fail  
  151 Defect New ---- ---- Medium ----   OS 10.5.4 and hacked iphone 2.0  
  152 Defect New ---- ---- Medium ----   LLVM-GCC Fails to Compile on Leopard With Workaround  
  153 Defect New ---- ---- Medium ----   /usr/lib/libc.dylib load command 7 unknown cmd field  
  154 Defect New ---- ---- Medium ----   Undefined framework symbols  
  155 Defect New ---- ---- Medium ----   Failed building odcctools [print_objc.o] Error  
  156 Defect New ---- ---- Medium ----   Program received signal EXC_BAD_ACCESS, Could not access memory.  
  157 Defect New ---- ---- Medium ----   Add .h dependency to the Makefiel  
  158 ---- New ---- ---- ---- ----   odcctools make problem, configure.in not found  
  159 ---- New ---- ---- ---- ----   odcctools make error on Mandriva  
  161 ---- New ---- ---- ---- ----   compilation of LLVM-GCC infinity loop  
  163 ---- New ---- ---- ---- ----   Only if you are compiling on leopard 10.5: "x" permission for "configure"  
  164 ---- New ---- ---- ---- ----   Can't find UIColor.h file (toolchain 2.0.3)  
  165 ---- New ---- ---- ---- ----   installing header files: ./configure --with-macosx-sdk=<relative-path> fails  
  166 ---- New ---- ---- ---- ----   No documentation on how to use the toolchain.  
  169 ---- New ---- ---- ---- ----   cannot run ./configure for llvm-svn on FreeBSD (VM) using repo 42498  
CSV
  
Powered by Google Project Hosting