My favorites | Sign in
Project Home Downloads Wiki Issues Code Search
New issue   Search
for
  Advanced search   Search tips   Subscriptions
Issue 148420: Autotest failure (desktopui_DocViewing) in bvt on x86-zgb-r23 (R23-2877.0.0)
1 person starred this issue and may be notified of changes. Back to list
Status:  Duplicate
Merged:  issue chromium-os:34257
Owner:  ----
Closed:  Sep 2012

Restricted
  • Only users with Commit permission may comment.


Sign in to add a comment
 
Reported by w...@chromium.org, Sep 11, 2012
As sheriff, I got the following autotest failure from the test farm.  Looks like a bug to me :).

A recent x86-zgb-r23 build, R23-2877.0.0, running on zgb, has failed testing. Please read through the information below and take action accordingly.
Full test logs are available through status links in the tables below. While the test source code can be accessed by clicking the test name.

Click here for the Chrome OS test dashboard to check historical results.
Click here for the build logs and image binaries.
Report summary:

desktopui_DocViewing
ERROR
Full report:

ERROR	 desktopui_DocViewing
Command <DISPLAY=:0 XAUTHORITY=/home/chronos/.Xauthority python /usr/local/autotest/deps/chrome_test/test_src/chrome/test/functional/pyauto_functional.py -v doc_viewing> failed, rc=1, Command returned non-zero exit status  * Command: 
      DISPLAY=:0 XAUTHORITY=/home/chronos/.Xauthority python /usr/local/autotes
      t/deps/chrome_test/test_src/chrome/test/functional/pyauto_functional.py -v
      doc_viewing
  Exit status: 1
  Duration: 63.2080771923
  
  stderr:
  2012-09-11 09:27:25,908 DEBUG    Loading 1 tests from ['doc_viewing']
  2012-09-11 09:27:25,910 DEBUG    Loading pyauto libs from /usr/local/autotest/deps/chrome_test/test_src/out/Release
  2012-09-11 09:27:27,082 DEBUG    Started http server at "chrome/test/data".
  [ RUN        ] doc_viewing.DocViewingTest.testOpenOfficeFiles: "Test we can open office files from the file manager."
  2012-09-11 09:27:48,323 DEBUG    WaitUntil(pyauto.py:1498 GetActiveTabTitle()) still waiting. Expecting Hidden columns.xlsx. Last returned /Downloads.
  2012-09-11 09:27:53,425 DEBUG    WaitUntil(pyauto.py:1498 GetActiveTabTitle()) still waiting. Expecting Hidden columns.xlsx. Last returned /Downloads.
  2012-09-11 09:27:58,269 DEBUG    WaitUntil(pyauto.py:1498 GetActiveTabTitle()) still waiting. Expecting Hidden columns.xlsx. Last returned /Downloads.
  2012-09-11 09:28:03,387 DEBUG    WaitUntil(pyauto.py:1498 GetActiveTabTitle()) still waiting. Expecting Hidden columns.xlsx. Last returned /Downloads.
  2012-09-11 09:28:08,232 DEBUG    WaitUntil(pyauto.py:1498 GetActiveTabTitle()) still waiting. Expecting Hidden columns.xlsx. Last returned /Downloads.
  2012-09-11 09:28:13,331 DEBUG    WaitUntil(pyauto.py:1498 GetActiveTabTitle()) still waiting. Expecting Hidden columns.xlsx. Last returned /Downloads.
  2012-09-11 09:28:18,429 DEBUG    WaitUntil(pyauto.py:1498 GetActiveTabTitle()) still waiting. Expecting Hidden columns.xlsx. Last returned /Downloads.
  2012-09-11 09:28:23,267 DEBUG    WaitUntil(pyauto.py:1498 GetActiveTabTitle()) still waiting. Expecting Hidden columns.xlsx. Last returned /Downloads.
  [     FAILED ] doc_viewing.DocViewingTest.testOpenOfficeFiles
  
  ======================================================================
  FAIL: doc_viewing.DocViewingTest.testOpenOfficeFiles: "Test we can open office files from the file manager."
  ----------------------------------------------------------------------
  Traceback (most recent call last):
    File "/usr/local/autotest/deps/chrome_test/test_src/chrome/test/functional/doc_viewing.py", line 68, in testOpenOfficeFiles
      msg='"%s" does not open.' % fname)
  AssertionError: "Hidden columns.xlsx" does not open.
  
  ----------------------------------------------------------------------
  Ran 1 test in 61.192s
  
  FAILED (failures=1)
  2012-09-11 09:28:28,434 DEBUG    Stopped http server.
  Tests can be disabled by editing /usr/local/autotest/deps/chrome_test/test_src/chrome/test/functional/PYAUTO_TESTS. Ref: http://dev.chromium.org/developers/testing/pyauto

[...displaying only the last 10 error log lines...]
09/11 09:28:28 ERROR|base_utils:0113| [stderr]   File "/usr/local/autotest/deps/chrome_test/test_src/chrome/test/functional/doc_viewing.py", line 68, in testOpenOfficeFiles
09/11 09:28:28 ERROR|base_utils:0113| [stderr]     msg='"%s" does not open.' % fname)
09/11 09:28:28 ERROR|base_utils:0113| [stderr] AssertionError: "Hidden columns.xlsx" does not open.
09/11 09:28:28 ERROR|base_utils:0113| [stderr] 
09/11 09:28:28 ERROR|base_utils:0113| [stderr] ----------------------------------------------------------------------
09/11 09:28:28 ERROR|base_utils:0113| [stderr] Ran 1 test in 61.192s
09/11 09:28:28 ERROR|base_utils:0113| [stderr] 
09/11 09:28:28 ERROR|base_utils:0113| [stderr] FAILED (failures=1)
09/11 09:28:28 ERROR|base_utils:0113| [stderr] 2012-09-11 09:28:28,434 DEBUG    Stopped http server.
09/11 09:28:28 ERROR|base_utils:0113| [stderr] Tests can be disabled by editing /usr/local/autotest/deps/chrome_test/test_src/chrome/test/functional/PYAUTO_TESTS. Ref: http://dev.chromium.org/developers/testing/pyauto
Sincerely,
Your test farm friends
From Mountain View, CA
Sep 11, 2012
#1 w...@chromium.org
Saw it again (bumping prio).  In case this is different:

A recent stumpy-r23 build, R23-2878.0.0, running on stumpy, has failed testing. Please read through the information below and take action accordingly.
Full test logs are available through status links in the tables below. While the test source code can be accessed by clicking the test name.

Click here for the Chrome OS test dashboard to check historical results.
Click here for the build logs and image binaries.
Report summary:

desktopui_DocViewing
ERROR
Full report:

ERROR	 desktopui_DocViewing
Command <DISPLAY=:0 XAUTHORITY=/home/chronos/.Xauthority python /usr/local/autotest/deps/chrome_test/test_src/chrome/test/functional/pyauto_functional.py -v doc_viewing> failed, rc=1, Command returned non-zero exit status  * Command: 
      DISPLAY=:0 XAUTHORITY=/home/chronos/.Xauthority python /usr/local/autotes
      t/deps/chrome_test/test_src/chrome/test/functional/pyauto_functional.py -v
      doc_viewing
  Exit status: 1
  Duration: 52.504390955
  
  stderr:
  2012-09-11 16:05:59,860 DEBUG    Loading 1 tests from ['doc_viewing']
  2012-09-11 16:05:59,860 DEBUG    Loading pyauto libs from /usr/local/autotest/deps/chrome_test/test_src/out/Release
  2012-09-11 16:06:00,336 DEBUG    Started http server at "chrome/test/data".
  [ RUN        ] doc_viewing.DocViewingTest.testOpenOfficeFiles: "Test we can open office files from the file manager."
  2012-09-11 16:06:11,925 DEBUG    WaitUntil(pyauto.py:1498 GetActiveTabTitle()) still waiting. Expecting worldhistory.docx. Last returned /Downloads.
  2012-09-11 16:06:16,968 DEBUG    WaitUntil(pyauto.py:1498 GetActiveTabTitle()) still waiting. Expecting worldhistory.docx. Last returned /Downloads.
  2012-09-11 16:06:22,007 DEBUG    WaitUntil(pyauto.py:1498 GetActiveTabTitle()) still waiting. Expecting worldhistory.docx. Last returned /Downloads.
  2012-09-11 16:06:27,044 DEBUG    WaitUntil(pyauto.py:1498 GetActiveTabTitle()) still waiting. Expecting worldhistory.docx. Last returned /Downloads.
  2012-09-11 16:06:32,082 DEBUG    WaitUntil(pyauto.py:1498 GetActiveTabTitle()) still waiting. Expecting worldhistory.docx. Last returned /Downloads.
  2012-09-11 16:06:37,121 DEBUG    WaitUntil(pyauto.py:1498 GetActiveTabTitle()) still waiting. Expecting worldhistory.docx. Last returned /Downloads.
  2012-09-11 16:06:41,907 DEBUG    WaitUntil(pyauto.py:1498 GetActiveTabTitle()) still waiting. Expecting worldhistory.docx. Last returned /Downloads.
  2012-09-11 16:06:46,945 DEBUG    WaitUntil(pyauto.py:1498 GetActiveTabTitle()) still waiting. Expecting worldhistory.docx. Last returned /Downloads.
  [     FAILED ] doc_viewing.DocViewingTest.testOpenOfficeFiles
  
  ======================================================================
  FAIL: doc_viewing.DocViewingTest.testOpenOfficeFiles: "Test we can open office files from the file manager."
  ----------------------------------------------------------------------
  Traceback (most recent call last):
    File "/usr/local/autotest/deps/chrome_test/test_src/chrome/test/functional/doc_viewing.py", line 68, in testOpenOfficeFiles
      msg='"%s" does not open.' % fname)
  AssertionError: "worldhistory.docx" does not open.
  
  ----------------------------------------------------------------------
  Ran 1 test in 51.618s
  
  FAILED (failures=1)
  2012-09-11 16:06:52,034 DEBUG    Stopped http server.
  Tests can be disabled by editing /usr/local/autotest/deps/chrome_test/test_src/chrome/test/functional/PYAUTO_TESTS. Ref: http://dev.chromium.org/developers/testing/pyauto

[...displaying only the last 10 error log lines...]
09/11 16:06:51 ERROR|base_utils:0113| [stderr]   File "/usr/local/autotest/deps/chrome_test/test_src/chrome/test/functional/doc_viewing.py", line 68, in testOpenOfficeFiles
09/11 16:06:51 ERROR|base_utils:0113| [stderr]     msg='"%s" does not open.' % fname)
09/11 16:06:51 ERROR|base_utils:0113| [stderr] AssertionError: "worldhistory.docx" does not open.
09/11 16:06:51 ERROR|base_utils:0113| [stderr] 
09/11 16:06:51 ERROR|base_utils:0113| [stderr] ----------------------------------------------------------------------
09/11 16:06:51 ERROR|base_utils:0113| [stderr] Ran 1 test in 51.618s
09/11 16:06:51 ERROR|base_utils:0113| [stderr] 
09/11 16:06:51 ERROR|base_utils:0113| [stderr] FAILED (failures=1)
09/11 16:06:52 ERROR|base_utils:0113| [stderr] 2012-09-11 16:06:52,034 DEBUG    Stopped http server.
09/11 16:06:52 ERROR|base_utils:0113| [stderr] Tests can be disabled by editing /usr/local/autotest/deps/chrome_test/test_src/chrome/test/functional/PYAUTO_TESTS. Ref: http://dev.chromium.org/developers/testing/pyauto
Sincerely,
Your test farm friends
From Mountain View, CA

Labels: -Pri-2 Pri-1
Sep 11, 2012
#2 w...@chromium.org
(No comment was entered for this change.)
Status: Duplicate
Mergedinto: 143302
Sep 11, 2012
#3 w...@chromium.org
(No comment was entered for this change.)
Mergedinto: chromium-os:34257
Oct 13, 2012
#4 bugdro...@chromium.org
This issue has been closed for some time. No one will pay attention to new comments.
If you are seeing this bug or have new data, please click New Issue to start a new bug.
Labels: Restrict-AddIssueComment-Commit
Mergedinto: chromium-os:34257
Mar 10, 2013
#5 bugdro...@chromium.org
(No comment was entered for this change.)
Labels: -Area-UI Cr-UI
Sign in to add a comment

Powered by Google Project Hosting